Target
Coagulation factor X
Ligand
BDBM50125023
Substrate
Meas. Tech.
ChEBML_69678
IC50
2±n/a nM
Citation
 Su, TYang, HVolkots, DWoolfrey, JDam, SWong, PSinha, UScarborough, RMZhu, BY Design, synthesis, and structure-activity relationships of substituted piperazinone-based transition state factor Xa inhibitors. Bioorg Med Chem Lett 13:729-32 (2003)  
Target
Name:
Coagulation factor X
Synonyms:
Activated coagulation factor X (FXa) Coagulation factor X precursor F10 Factor X heavy chain Factor Xa Stuart-Prower factor
Type:
Enzyme
Mol. Mass.:
54726.60
Organism:
Homo sapiens (Human)
Description:
Residue:
488
  
Inhibitor
Name:
BDBM50125023
Synonyms:
(R)-N-{[4-Guanidino-1-(thiazole-2-carbonyl)-butylcarbamoyl]-methyl}-3-phenyl-2-phenylmethanesulfonylamino-propionamide | CHEMBL162710
Type:
Small organic molecule
Emp. Form.:
C27H33N7O5S2
Mol. Mass.:
599.725
SMILES:
NC(=N)NCCCC(NC(=O)CNC(=O)[C@@H](Cc1ccccc1)NS(=O)(=O)Cc1ccccc1)C(=O)c1nccs1
: