Target
Coagulation factor X
Ligand
BDBM50125029
Substrate
Meas. Tech.
ChEBML_69678
IC50
31±n/a nM
Citation
 Su, TYang, HVolkots, DWoolfrey, JDam, SWong, PSinha, UScarborough, RMZhu, BY Design, synthesis, and structure-activity relationships of substituted piperazinone-based transition state factor Xa inhibitors. Bioorg Med Chem Lett 13:729-32 (2003)  
Target
Name:
Coagulation factor X
Synonyms:
Activated coagulation factor X (FXa) Coagulation factor X precursor F10 Factor X heavy chain Factor Xa Stuart-Prower factor
Type:
Enzyme
Mol. Mass.:
54726.60
Organism:
Homo sapiens (Human)
Description:
Residue:
488
  
Inhibitor
Name:
BDBM50125029
Synonyms:
((R)-4-{[(S)-4-Guanidino-1-(thiazole-2-carbonyl)-butylcarbamoyl]-methyl}-3-oxo-1-phenylmethanesulfonyl-piperazin-2-yl)-acetic acid | CHEMBL352681
Type:
Small organic molecule
Emp. Form.:
C24H31N7O7S2
Mol. Mass.:
593.676
SMILES:
NC(=N)NCCC[C@H](NC(=O)CN1CCN([C@H](CC(O)=O)C1=O)S(=O)(=O)Cc1ccccc1)C(=O)c1nccs1
: