Target
Coagulation factor X
Ligand
BDBM50125042
Substrate
Meas. Tech.
ChEBML_69678
IC50
59.0±n/a nM
Citation
 Su, TYang, HVolkots, DWoolfrey, JDam, SWong, PSinha, UScarborough, RMZhu, BY Design, synthesis, and structure-activity relationships of substituted piperazinone-based transition state factor Xa inhibitors. Bioorg Med Chem Lett 13:729-32 (2003)  
Target
Name:
Coagulation factor X
Synonyms:
Activated coagulation factor X (FXa) Coagulation factor X precursor F10 Factor X heavy chain Factor Xa Stuart-Prower factor
Type:
Enzyme
Mol. Mass.:
54726.60
Organism:
Homo sapiens (Human)
Description:
Residue:
488
  
Inhibitor
Name:
BDBM50125042
Synonyms:
2-((R)-3-Benzyl-2-oxo-4-phenylmethanesulfonyl-piperazin-1-yl)-N-[(S)-4-guanidino-1-(thiazole-2-carbonyl)-butyl]-acetamide CHEMBL405427
Type:
Small organic molecule
Emp. Form.:
C29H35N7O5S2
Mol. Mass.:
625.762
SMILES:
NC(=N)NCCC[C@H](NC(=O)CN1CCN([C@H](Cc2ccccc2)C1=O)S(=O)(=O)Cc1ccccc1)C(=O)c1nccs1
: