Target
Mu-type opioid receptor
Ligand
BDBM50126000
Substrate
Meas. Tech.
ChEBML_148834
Ki
0.021600±n/a nM
Citation
 Ambo, ANiizuma, HSasaki, AKohara, HSasaki, Y Dermorphin tetrapeptide analogues with 2',6'-dimethylphenylalanine (Dmp) substituted for aromatic amino acids have high mu opioid receptor binding and biological activities. Bioorg Med Chem Lett 13:1269-72 (2003)  
Target
Name:
Mu-type opioid receptor
Synonyms:
MOR-1 Mu-type opioid receptor (MOR) OPRM_RAT Opioid receptor B Ror-b
Type:
G Protein-Coupled Receptor (GPCR)
Mol. Mass.:
44503.11
Organism:
Rattus norvegicus (rat)
Description:
Competition binding assays were carried out using membrane preparations from transfected HN9.10 cells that constitutively expressed the mu opioid receptor.
Residue:
398
  
Inhibitor
Name:
BDBM50126000
Synonyms:
(R)-2-[(S)-2-Amino-3-(2,6-dimethyl-phenyl)-propionylamino]-5-guanidino-pentanoic acid [(S)-1-(2-carbamoyl-ethylcarbamoyl)-2-(2,6-dimethyl-phenyl)-ethyl]-amide | CHEMBL24059
Type:
Small organic molecule
Emp. Form.:
C31H46N8O4
Mol. Mass.:
594.7481
SMILES:
Cc1cccc(C)c1C[C@H](N)C(=O)N[C@H](CCCNC(N)=N)C(=O)N[C@@H](Cc1c(C)cccc1C)C(=O)NCCC(N)=O
: