Target
Inosine-5'-monophosphate dehydrogenase 2
Ligand
BDBM50126265
Substrate
Meas. Tech.
ChEBML_235
IC50
150±n/a nM
Citation
 Chen, PNorris, DHaslow, KDMurali Dhar, TGPitts, WJWatterson, SHCheney, DLBassolino, DAFleener, CARouleau, KAHollenbaugh, DLTownsend, RMBarrish, JCIwanowicz, EJ Identification of novel and potent isoquinoline aminooxazole-based IMPDH inhibitors. Bioorg Med Chem Lett 13:1345-8 (2003)  
Target
Name:
Inosine-5'-monophosphate dehydrogenase 2
Synonyms:
IMDH2_HUMAN IMPD 2 IMPDH-II Inosine 5'-monophosphate dehydrogenase II (IMPDH II) Inosine-5 -monophosphate dehydrogenase 2 | Inosine-5'-monophosphate dehydrogenase (IMPDH)
Type:
Enzyme
Mol. Mass.:
55806.87
Organism:
Homo sapiens (Human)
Description:
Recombinant IMPDH2 expressed in E. coli.
Residue:
514
  
Inhibitor
Name:
BDBM50126265
Synonyms:
1-Quinazolin-7-yl-3-m-tolyl-urea | CHEMBL26741
Type:
Small organic molecule
Emp. Form.:
C16H14N4O
Mol. Mass.:
278.3086
SMILES:
Cc1cccc(NC(=O)Nc2ccc3cncnc3c2)c1
: