Target
Ribosomal protein S6 kinase beta-1/beta-2
Ligand
BDBM50126732
Substrate
Meas. Tech.
ChEMBL_195569 (CHEMBL803660)
IC50
>1000±n/a nM
Citation
 Goldberg, DRButz, TCardozo, MGEckner, RJHammach, AHuang, JJakes, SKapadia, SKashem, MLukas, SMorwick, TMPanzenbeck, MPatel, UPav, SPeet, GWPeterson, JDProkopowicz, ASSnow, RJSellati, RTakahashi, HTan, JTschantz, MAWang, XJWang, YWolak, JXiong, PMoss, N Optimization of 2-phenylaminoimidazo[4,5-h]isoquinolin-9-ones: orally active inhibitors of lck kinase. J Med Chem 46:1337-49 (2003)  
Target
Name:
Ribosomal protein S6 kinase beta-1/beta-2
Synonyms:
Ribosomal protein S6 kinase (P70S6K) Ribosomal protein S6 kinase 2/S6K1
Type:
Mol. Mass.:
Description:
ASSAY_ID of EBI is 195569
Components:
This complex has 2 components.
Component 1
Name:
Ribosomal protein S6 kinase beta-1
Synonyms:
70 kDa ribosomal protein S6 kinase 1 70 kDa ribosomal protein kinase (p70S6K) Protein kinase 70S6K (T412E) RPS6KB1 Ribosomal protein S6 kinase I STK14A p70S6K1
Type:
Enzyme
Mol. Mass.:
59139.89
Organism:
Homo sapiens (Human)
Description:
His-tagged S6K1.
Residue:
525
  
Component 2
Name:
Ribosomal protein S6 kinase beta-2
Synonyms:
KS6B2_HUMAN Ribosomal protein S6 kinase (P70S6K) | STK14B
Type:
PROTEIN
Mol. Mass.:
53460.10
Organism:
Homo sapiens (Human)
Description:
ChEMBL_306115
Residue:
482
  
Component 3
Name:
Ribosomal protein S6 kinase beta-2
Synonyms:
KS6B2_HUMAN Ribosomal protein S6 kinase (P70S6K) | STK14B
Type:
PROTEIN
Mol. Mass.:
53460.10
Organism:
Homo sapiens (Human)
Description:
ChEMBL_306115
Residue:
482
  
Inhibitor
Name:
BDBM50126732
Synonyms:
2-(2,6-Dichloro-phenylamino)-7-(3-diethylamino-propenyl)-1,6-dimethyl-1,8-dihydro-imidazo[4,5-h]isoquinolin-9-one | CHEMBL281957
Type:
Small organic molecule
Emp. Form.:
C25H27Cl2N5O
Mol. Mass.:
484.421
SMILES:
CCN(CC)CC=Cc1[nH]c(=O)c2c3n(C)c(Nc4c(Cl)cccc4Cl)nc3ccc2c1C
: