Target
Tyrosine-protein kinase Lck
Ligand
BDBM50126745
Substrate
Meas. Tech.
ChEMBL_221314 (CHEMBL841204)
IC50
740±n/a nM
Citation
 Goldberg, DRButz, TCardozo, MGEckner, RJHammach, AHuang, JJakes, SKapadia, SKashem, MLukas, SMorwick, TMPanzenbeck, MPatel, UPav, SPeet, GWPeterson, JDProkopowicz, ASSnow, RJSellati, RTakahashi, HTan, JTschantz, MAWang, XJWang, YWolak, JXiong, PMoss, N Optimization of 2-phenylaminoimidazo[4,5-h]isoquinolin-9-ones: orally active inhibitors of lck kinase. J Med Chem 46:1337-49 (2003)  
Target
Name:
Tyrosine-protein kinase Lck
Synonyms:
2.7.10.2 LCK_HUMAN Leukocyte C-terminal Src kinase Lymphocyte-specific protein tyrosine kinase Protein YT16 Proto-oncogene tyrosine-protein kinase LCK T cell-specific protein-tyrosine kinase
Type:
Mol. Mass.:
57987.83
Organism:
Homo sapiens (Human)
Description:
P06239
Residue:
509
  
Inhibitor
Name:
BDBM50126745
Synonyms:
2-(2,6-Dichloro-phenylamino)-1,7-dimethyl-6-(2-oxo-2-pyrrolidin-1-yl-ethyl)-1,8-dihydro-imidazo[4,5-h]isoquinolin-9-one | CHEMBL26209
Type:
Small organic molecule
Emp. Form.:
C24H23Cl2N5O2
Mol. Mass.:
484.378
SMILES:
Cc1[nH]c(=O)c2c3n(C)c(Nc4c(Cl)cccc4Cl)nc3ccc2c1CC(=O)N1CCCC1
: