Target
Peptidyl-prolyl cis-trans isomerase FKBP1A
Ligand
BDBM36609
Substrate
Meas. Tech.
ChEMBL_2080978 (CHEMBL4736769)
EC50
36±n/a nM
Citation
 Aizpurua, JMMiranda, JIIrastorza, ATorres, EEceiza, MSagartzazu-Aizpurua, MFerrón, PAldanondo, GLasa-Fernández, HMarco-Moreno, PDadie, NLópez de Munain, AVallejo-Illarramendi, A Discovery of a novel family of FKBP12 "reshapers" and their use as calcium modulators in skeletal muscle under nitro-oxidative stress. Eur J Med Chem 213:0 (2021)  
Target
Name:
Peptidyl-prolyl cis-trans isomerase FKBP1A
Synonyms:
12 kDa FK506-binding protein FK506-binding protein 1A FKB1A_HUMAN FKBP-1A FKBP12 Immunophilin FKBP12 PPIase FKBP1A Rotamase mTOR/FKBP12A/FKBP12B
Type:
Isomerase
Mol. Mass.:
11953.09
Organism:
Homo sapiens (Human)
Description:
P62942
Residue:
108
  
Inhibitor
Name:
BDBM36609
Synonyms:
Rapamycin C-7, analog 4 US11603377, Compound Ramycin
Type:
Small organic molecule
Emp. Form.:
C51H79NO13
Mol. Mass.:
914.1719
SMILES:
CO[C@@H]1C[C@H](C[C@@H](C)[C@@H]2CC(=O)[C@H](C)\C=C(C)\[C@@H](O)[C@@H](OC)C(=O)[C@H](C)C[C@H](C)\C=C\C=C\C=C(C)\[C@H](C[C@@H]3CC[C@@H](C)[C@@](O)(O3)C(=O)C(=O)N3CCCC[C@H]3C(=O)O2)OC)CC[C@H]1O
: