Target
ATP-sensitive inward rectifier potassium channel 11
Ligand
BDBM50127776
Substrate
Meas. Tech.
ChEBML_92724
EC50
276±n/a nM
Citation
 Turner, SCCarroll, WAWhite, TKBrune, MEBuckner, SAGopalakrishnan, MFabiyi, ACoghlan, MJScott, VECastle, NADaza, AVMilicic, ISullivan, JP Structure-activity relationship of a novel class of naphthyl amide KATP channel openers. Bioorg Med Chem Lett 13:1741-4 (2003)  
Target
Name:
ATP-sensitive inward rectifier potassium channel 11
Synonyms:
ATP-sensitive inward rectifier potassium channel 11 Inward rectifier K(+) channel Kir6.2 KCNJ11 Potassium channel, inwardly rectifying, subfamily J, member 11 Sulfonylurea receptor 2, Kir6.2
Type:
Enzyme Catalytic Domain
Mol. Mass.:
43549.41
Organism:
Homo sapiens (Human)
Description:
Potassium channel (ATP modulatory) 0 0::Q14654
Residue:
390
  
Inhibitor
Name:
BDBM50127776
Synonyms:
1-(4-Chloro-phenyl)-3-[2-(2,2,2-trifluoro-1-hydroxy-1-trifluoromethyl-ethyl)-naphthalen-1-yl]-urea | CHEMBL48174
Type:
Small organic molecule
Emp. Form.:
C20H13ClF6N2O2
Mol. Mass.:
462.773
SMILES:
OC(c1ccc2ccccc2c1NC(=O)Nc1ccc(Cl)cc1)(C(F)(F)F)C(F)(F)F
: