Target
5-hydroxytryptamine receptor 4
Ligand
BDBM29526
Substrate
Meas. Tech.
ChEMBL_3572 (CHEMBL620705)
Ki
1±n/a nM
Citation
 Berque-Bestel, ISoulier, JLGiner, MRivail, LLanglois, MSicsic, S Synthesis and characterization of the first fluorescent antagonists for human 5-HT4 receptors. J Med Chem 46:2606-20 (2003)  
Target
Name:
5-hydroxytryptamine receptor 4
Synonyms:
5-HT-4 5-HT4S 5-HT4b 5-HT4d 5-hydroxytryptamine receptor 4 5HT4R_HUMAN Serotonin (5-HT) receptor Serotonin 4 (5-HT4) receptor | Serotonin Receptor 4
Type:
Enzyme
Mol. Mass.:
43767.54
Organism:
Homo sapiens (Human)
Description:
Q13639
Residue:
388
  
Inhibitor
Name:
BDBM29526
Synonyms:
2-Piperidinoethyl 4-amino-5-chloro-2-methoxybenzoate ML 10302 | ML10302
Type:
Small organic molecule
Emp. Form.:
C15H21ClN2O3
Mol. Mass.:
312.792
SMILES:
COc1cc(N)c(Cl)cc1C(=O)OCCN1CCCCC1
: