Target
Bifunctional dihydrofolate reductase-thymidylate synthase
Ligand
BDBM50130321
Substrate
Meas. Tech.
ChEMBL_55431 (CHEMBL667624)
Ki
700±n/a nM
Citation
 Rastelli, GPacchioni, SSirawaraporn, WSirawaraporn, RParenti, MDFerrari, AM Docking and database screening reveal new classes of Plasmodium falciparum dihydrofolate reductase inhibitors. J Med Chem 46:2834-45 (2003)  
Target
Name:
Bifunctional dihydrofolate reductase-thymidylate synthase
Synonyms:
DHFR-TS Dihydrofolate Reductase-Thymidylate Synthase (DHFR-TS) Mutant KICB1 PfDHFR-TS double mutant (C59R+S108N)
Type:
Enzyme
Mol. Mass.:
71822.51
Organism:
Plasmodium falciparum (isolate K1 / Thailand)
Description:
The mutant clone was prepared by cassette mutagenesis using wildtype pfDHFR as a template, and expressed in E. coli.
Residue:
608
  
Inhibitor
Name:
BDBM50130321
Synonyms:
(1E)-1-{4-[(3,5-dichloropyridin-4-yl)oxy]phenyl}ethan-1-one thiosemicarbazone | CHEMBL97598
Type:
Small organic molecule
Emp. Form.:
C14H12Cl2N4OS
Mol. Mass.:
355.242
SMILES:
CC(=NNC(N)=S)c1ccc(Oc2c(Cl)cncc2Cl)cc1
: