Target
5-hydroxytryptamine receptor 1F
Ligand
BDBM50130426
Substrate
Meas. Tech.
ChEMBL_2074 (CHEMBL616718)
EC50
32±n/a nM
Citation
 Filla, SAMathes, BMJohnson, KWPhebus, LACohen, MLNelson, DLZgombick, JMErickson, JASchenck, KWWainscott, DBBranchek, TASchaus, JM Novel potent 5-HT(1F) receptor agonists: structure-activity studies of a series of substituted N-[3-(1-methyl-4-piperidinyl)-1H-pyrrolo[3,2-b]pyridin-5-yl]amides. J Med Chem 46:3060-71 (2003)  
Target
Name:
5-hydroxytryptamine receptor 1F
Synonyms:
5-HT-1F 5-hydroxytryptamine receptor 1F HTR1EL Serotonin (5-HT) receptor Serotonin receptor 1F
Type:
Enzyme Catalytic Domain
Mol. Mass.:
41724.68
Organism:
Homo sapiens (Human)
Description:
5-HT1F HTR1F HUMAN::P30939
Residue:
366
  
Inhibitor
Name:
BDBM50130426
Synonyms:
CHEMBL105261 | N-[3-(1-Methyl-piperidin-4-yl)-1H-pyrrolo[3,2-b]pyridin-5-yl]-propionamide
Type:
Small organic molecule
Emp. Form.:
C16H22N4O
Mol. Mass.:
286.3721
SMILES:
CCC(=O)Nc1ccc2[nH]cc(C3CCN(C)CC3)c2n1
: