Target
Tyrosine-protein kinase Lck
Ligand
BDBM13357
Substrate
Meas. Tech.
ChEMBL_221308 (CHEMBL841198)
IC50
0.500000±n/a nM
Citation
 Das, JMoquin, RVLin, JLiu, CDoweyko, AMDeFex, HFFang, QPang, SPitt, SShen, DRSchieven, GLBarrish, JCWityak, J Discovery of 2-amino-heteroaryl-benzothiazole-6-anilides as potent p56(lck) inhibitors. Bioorg Med Chem Lett 13:2587-90 (2003)  
Target
Name:
Tyrosine-protein kinase Lck
Synonyms:
2.7.10.2 LCK_HUMAN Leukocyte C-terminal Src kinase Lymphocyte-specific protein tyrosine kinase Protein YT16 Proto-oncogene tyrosine-protein kinase LCK T cell-specific protein-tyrosine kinase
Type:
Mol. Mass.:
57987.83
Organism:
Homo sapiens (Human)
Description:
P06239
Residue:
509
  
Inhibitor
Name:
BDBM13357
Synonyms:
CHEMBL312933 benzothiazole analog 13a
Type:
Small Organic Molecule
Emp. Form.:
C22H20ClN5O2S
Mol. Mass.:
453.945
SMILES:
Cc1cccc(Cl)c1NC(=O)c1ccc2nc(Nc3cccc(NCCO)n3)sc2c1
: