Target
5-hydroxytryptamine receptor 1A
Ligand
BDBM50131709
Substrate
Meas. Tech.
ChEMBL_1120 (CHEMBL616065)
Ki
0.35±n/a nM
Citation
 Betti, LCorelli, FFloridi, MGiannaccini, GMaccari, LManetti, FStrappaghetti, GBotta, M Alpha1-adrenoceptor antagonists. 6. Structural optimization of pyridazinone-arylpiperazines. Study of the influence on affinity and selectivity of cyclic substituents at the pyridazinone ring and alkoxy groups at the arylpiperazine moiety. J Med Chem 46:3555-8 (2003)  
Target
Name:
5-hydroxytryptamine receptor 1A
Synonyms:
5-HT-1A 5-HT1A 5-hydroxytryptamine receptor 1A (5HT1A) 5ht1a Htr1a Serotonin 1a (5-HT1a) receptor/Adrenergic receptor alpha-1 | Serotonin receptor 1A
Type:
G Protein-Coupled Receptor (GPCR)
Mol. Mass.:
46445.29
Organism:
Rattus norvegicus (rat)
Description:
Binding assays were performed using rat hippocampal membranes.
Residue:
422
  
Inhibitor
Name:
BDBM50131709
Synonyms:
5-Chloro-2-{7-[4-(2-ethoxy-phenyl)-piperazin-1-yl]-heptyl}-4-[4-(furan-2-carbonyl)-piperazin-1-yl]-2H-pyridazin-3-one | CHEMBL118704
Type:
Small organic molecule
Emp. Form.:
C32H43ClN6O4
Mol. Mass.:
611.175
SMILES:
CCOc1ccccc1N1CCN(CCCCCCCn2ncc(Cl)c(N3CCN(CC3)C(=O)c3ccco3)c2=O)CC1
: