Target
Inositol-trisphosphate 3-kinase A
Ligand
BDBM50075183
Substrate
Meas. Tech.
ChEMBL_90112 (CHEMBL873229)
IC50
43700±n/a nM
Citation
 Kwon, YUIm, JChoi, GKim, YSChoi, KYChung, SK Synthesis of three enantiomeric pairs of scyllo-inositol phosphate and molecular interactions between all possible regioisomers of scyllo-inositol phosphate and inositol 1,4,5-trisphosphate 3-kinase. Bioorg Med Chem Lett 13:2981-4 (2003)  
Target
Name:
Inositol-trisphosphate 3-kinase A
Synonyms:
IP3KA_RAT | Itpka
Type:
PROTEIN
Mol. Mass.:
50877.10
Organism:
Rattus norvegicus
Description:
ChEMBL_90112
Residue:
459
  
Inhibitor
Name:
BDBM50075183
Synonyms:
1,4,5-Insp3 1D-myo-inositol 1,4,5-tris(dihydrogen phosphate) 3,5,6-trioxyphosphate-1,2,4-cyclohexanetriol D-myo-inositol 1,4,5-trisphosphate InsP3
Type:
Small organic molecule
Emp. Form.:
C6H15O15P3
Mol. Mass.:
420.0956
SMILES:
O[C@@H]1[C@H](O)[C@@H](OP(O)(O)=O)[C@H](OP(O)(O)=O)[C@@H](O)[C@@H]1OP(O)(O)=O
: