Target
D(3) dopamine receptor
Ligand
BDBM50099814
Substrate
Meas. Tech.
ChEMBL_62108 (CHEMBL674986)
Ki
250±n/a nM
Citation
 Einsiedel, JWeber, KThomas, CLehmann, THübner, HGmeiner, P Stereocontrolled dopamine receptor binding and subtype selectivity of clebopride analogues synthesized from aspartic acid. Bioorg Med Chem Lett 13:3293-6 (2003)  
Target
Name:
D(3) dopamine receptor
Synonyms:
DOPAMINE D3 DRD3_HUMAN Dopamine D3 receptor (D3) Dopamine receptor Dopamine receptor D3
Type:
Mol. Mass.:
44243.43
Organism:
Homo sapiens (Human)
Description:
Residue:
400
  
Inhibitor
Name:
BDBM50099814
Synonyms:
4-Bromo-1-methoxy-naphthalene-2-carboxylic acid ((R)-1-benzyl-pyrrolidin-3-yl)-amide CHEMBL298875
Type:
Small organic molecule
Emp. Form.:
C23H23BrN2O2
Mol. Mass.:
439.345
SMILES:
COc1c(cc(Br)c2ccccc12)C(=O)N[C@@H]1CCN(Cc2ccccc2)C1
: