Target
Corticotropin-releasing factor receptor 1
Ligand
BDBM50132901
Substrate
Meas. Tech.
ChEBML_51133
Ki
1.7±n/a nM
Citation
 Wilcoxen, KHuang, CQMcCarthy, JRGrigoriadis, DEChen, C Synthesis of 3-phenylpyrazolo[4,3-b]pyridines via a convenient synthesis of 4-amino-3-arylpyrazoles and SAR of corticotropin-releasing factor receptor type-1 antagonists. Bioorg Med Chem Lett 13:3367-70 (2003)  
Target
Name:
Corticotropin-releasing factor receptor 1
Synonyms:
CRF-R CRF1 CRFR1 CRH-R 1 CRHR1 Corticotropin-releasing factor receptor 1 (CRF-1) Corticotropin-releasing hormone receptor 1
Type:
Enzyme
Mol. Mass.:
50744.31
Organism:
Homo sapiens (Human)
Description:
P34998
Residue:
444
  
Inhibitor
Name:
BDBM50132901
Synonyms:
CHEMBL445075 | Cyclopropylmethyl-[3-(2,4-dichloro-phenyl)-1,5-dimethyl-1H-pyrazolo[4,3-b]pyridin-7-yl]-propyl-amine
Type:
Small organic molecule
Emp. Form.:
C21H24Cl2N4
Mol. Mass.:
403.348
SMILES:
CCCN(CC1CC1)c1cc(C)nc2c(nn(C)c12)-c1ccc(Cl)cc1Cl
: