Target
Prothrombin
Ligand
BDBM50069190
Substrate
Meas. Tech.
ChEBML_208918
Ki
0.500000±n/a nM
Citation
 Rittle, KEBarrow, JCCutrona, KJGlass, KLKrueger, JAKuo, LCLewis, SDLucas, BJMcMasters, DRMorrissette, MMNantermet, PGNewton, CLSanders, WMYan, YVacca, JPSelnick, HG Unexpected enhancement of thrombin inhibitor potency with o-aminoalkylbenzylamides in the P1 position. Bioorg Med Chem Lett 13:3477-82 (2003)  
Target
Name:
Prothrombin
Synonyms:
Activation peptide fragment 1 Coagulation factor II Prothrombin precursor Thrombin heavy chain | Thrombin light chain
Type:
Protein
Mol. Mass.:
70029.57
Organism:
Homo sapiens (Human)
Description:
P00734
Residue:
622
  
Inhibitor
Name:
BDBM50069190
Synonyms:
CHEMBL287614 | N-(1-Carbamimidoyl-piperidin-4-ylmethyl)-2-(6-methyl-2-oxo-3-phenylmethanesulfonylamino-2H-pyridin-1-yl)-acetamide
Type:
Small organic molecule
Emp. Form.:
C22H30N6O4S
Mol. Mass.:
474.576
SMILES:
Cc1ccc(NS(=O)(=O)Cc2ccccc2)c(=O)n1CC(=O)NCC1CCN(CC1)C(N)=N
: