Target
Beta-secretase 1
Ligand
BDBM50134705
Substrate
Meas. Tech.
ChEMBL_41372 (CHEMBL653332)
IC50
120±n/a nM
Citation
 John, VBeck, JPBienkowski, MJSinha, SHeinrikson, RL Human beta-secretase (BACE) and BACE inhibitors. J Med Chem 46:4625-30 (2003)  
Target
Name:
Beta-secretase 1
Synonyms:
ASP2 Aspartyl protease 2 BACE1 Beta-secretase (BACE) Beta-secretase 1 (BACE 1) Beta-secretase 1 (BACE1) Beta-site amyloid precursor protein cleaving enzyme 1 Memapsin-2 beta-Secretase (BACE-1) | beta-Secretase (BACE1)
Type:
Protein
Mol. Mass.:
55755.10
Organism:
Homo sapiens (Human)
Description:
P56817
Residue:
501
  
Inhibitor
Name:
BDBM50134705
Synonyms:
5-{2-[4-(2-Biphenyl-2-yl-2-hydroxy-acetylamino)-5-(3,5-difluoro-phenyl)-3-hydroxy-pentanoylamino]-3-methyl-butyrylamino}-isophthalic acid dimethyl ester | CHEMBL143687
Type:
Small organic molecule
Emp. Form.:
C40H41F2N3O9
Mol. Mass.:
745.765
SMILES:
COC(=O)c1cc(NC(=O)[C@@H](NC(=O)C[C@H](O)[C@H](Cc2cc(F)cc(F)c2)NC(=O)C(O)c2ccccc2-c2ccccc2)C(C)C)cc(c1)C(=O)OC
: