Target
Beta-secretase 1
Ligand
BDBM50134704
Substrate
Meas. Tech.
ChEMBL_41372 (CHEMBL653332)
IC50
30±n/a nM
Citation
 John, VBeck, JPBienkowski, MJSinha, SHeinrikson, RL Human beta-secretase (BACE) and BACE inhibitors. J Med Chem 46:4625-30 (2003)  
Target
Name:
Beta-secretase 1
Synonyms:
ASP2 Aspartyl protease 2 BACE1 Beta-secretase (BACE) Beta-secretase 1 (BACE 1) Beta-secretase 1 (BACE1) Beta-site amyloid precursor protein cleaving enzyme 1 Memapsin-2 beta-Secretase (BACE-1) | beta-Secretase (BACE1)
Type:
Protein
Mol. Mass.:
55755.10
Organism:
Homo sapiens (Human)
Description:
P56817
Residue:
501
  
Inhibitor
Name:
BDBM50134704
Synonyms:
CHEMBL2370886 | Peptide BACE derivative
Type:
Small organic molecule
Emp. Form.:
C74H121N15O26S
Mol. Mass.:
1668.902
SMILES:
CC[C@H](C)[C@H](NC(=O)[C@H](CCC(O)=O)NC(=O)[C@H](CCC(O)=O)NC(=O)[C@@H](NC(=O)[C@@H](N)CCCN)C(O)CC)C(=O)N[C@@H](CO)C(=O)N[C@@H](CCC(O)=O)C(=O)N[C@@H](C(C)C)C(=O)N[C@@H](CCSC)C(=O)N[C@@H](CC(C)C)[C@@H](O)CC(=O)N[C@@H](C(C)C)C(=O)N[C@@H](C)C(=O)N[C@@H](CCC(O)=O)C(=O)N[C@@H](Cc1ccccc1)C(O)=O
: