Target
Adenosine kinase
Ligand
BDBM50134739
Substrate
Meas. Tech.
ChEMBL_31113 (CHEMBL642224)
IC50
400±n/a nM
Citation
 Ugarkar, BGCastellino, AJDaRe, JSRamirez-Weinhouse, MKopcho, JJRosengren, SErion, MD Adenosine kinase inhibitors. 3. Synthesis, SAR, and antiinflammatory activity of a series of l-lyxofuranosyl nucleosides. J Med Chem 46:4750-60 (2003)  
Target
Name:
Adenosine kinase
Synonyms:
ADK | ADK_HUMAN
Type:
PROTEIN
Mol. Mass.:
40545.97
Organism:
Homo sapiens (Human)
Description:
ChEMBL_1467841
Residue:
362
  
Inhibitor
Name:
BDBM50134739
Synonyms:
(1R,2R,3S)-2-(4-Amino-5-iodo-pyrrolo[2,3-d]pyrimidin-7-yl)-5-methyl-tetrahydro-furan-3,4-diol CHEMBL145388
Type:
Small organic molecule
Emp. Form.:
C11H13IN4O3
Mol. Mass.:
376.1504
SMILES:
C[C@@H]1O[C@H]([C@H](O)[C@@H]1O)n1cc(I)c2c(N)ncnc12
: