Target
Beta-secretase 1
Ligand
BDBM50135164
Substrate
Meas. Tech.
ChEMBL_41386 (CHEMBL653508)
Ki
5300±n/a nM
Citation
 Jeon, SYBae, KSeong, YHSong, KS Green tea catechins as a BACE1 (beta-secretase) inhibitor. Bioorg Med Chem Lett 13:3905-8 (2003)  
Target
Name:
Beta-secretase 1
Synonyms:
ASP2 Aspartyl protease 2 BACE1 Beta-secretase (BACE) Beta-secretase 1 (BACE 1) Beta-secretase 1 (BACE1) Beta-site amyloid precursor protein cleaving enzyme 1 Memapsin-2 beta-Secretase (BACE-1) | beta-Secretase (BACE1)
Type:
Protein
Mol. Mass.:
55755.10
Organism:
Homo sapiens (Human)
Description:
P56817
Residue:
501
  
Inhibitor
Name:
BDBM50135164
Synonyms:
3,4,5-Trihydroxy-benzoic acid (2S,3S)-2-(3,4-dihydroxy-phenyl)-5,7-dihydroxy-chroman-3-yl ester | CHEMBL126142
Type:
Small organic molecule
Emp. Form.:
C22H18O10
Mol. Mass.:
442.3723
SMILES:
Oc1cc(O)c2C[C@H](OC(=O)c3cc(O)c(O)c(O)c3)[C@@H](Oc2c1)c1ccc(O)c(O)c1
: