Target
Epidermal growth factor receptor
Ligand
BDBM50136230
Substrate
Meas. Tech.
ChEMBL_66889 (CHEMBL675513)
IC50
578.0±n/a nM
Citation
 Banerjee, RRachid, ZMcNamee, JJean-Claude, BJ Synthesis of a prodrug designed to release multiple inhibitors of the epidermal growth factor receptor tyrosine kinase and an alkylating agent: a novel tumor targeting concept. J Med Chem 46:5546-51 (2003)  
Target
Name:
Epidermal growth factor receptor
Synonyms:
EGFR_MOUSE Epidermal growth factor receptor erbB1
Type:
PROTEIN
Mol. Mass.:
134859.02
Organism:
Mus musculus
Description:
ChEMBL_305656
Residue:
1210
  
Inhibitor
Name:
BDBM50136230
Synonyms:
6-[(1E)-3-acetyl-3-methyltriaz-1-enyl]-N-(3-methylphenyl)quinazolin-4-amine | CHEMBL153577
Type:
Small organic molecule
Emp. Form.:
C18H18N6O
Mol. Mass.:
334.3751
SMILES:
CN(\N=N\c1ccc2ncnc(Nc3cccc(C)c3)c2c1)C(C)=O
: