Target
Melatonin receptor type 1B
Ligand
BDBM50136400
Substrate
Meas. Tech.
ChEBML_105266
Ki
0.400000±n/a nM
Citation
 Sun, LQChen, JMattson, RJEpperson, JRDeskus, JALi, WSTakaki, KHodges, DBIben, LMahle, CDOrtiz, AMolstad, DRyan, EYeleswaram, KXu, CLuo, G Heterocyclic aminopyrrolidine derivatives as melatoninergic agents. Bioorg Med Chem Lett 13:4381-4 (2003)  
Target
Name:
Melatonin receptor type 1B
Synonyms:
MTNR1B Mel-1B-R Melatonin 1B Melatonin receptor type 1B | Melatonin receptor type 2 (MT2)
Type:
Enzyme
Mol. Mass.:
40203.54
Organism:
Homo sapiens (Human)
Description:
P49286
Residue:
362
  
Inhibitor
Name:
BDBM50136400
Synonyms:
CHEMBL343825 | N-[(S)-1-(2,3-Dihydro-benzofuran-4-yl)-pyrrolidin-3-yl]-propionamide
Type:
Small organic molecule
Emp. Form.:
C15H20N2O2
Mol. Mass.:
260.3315
SMILES:
CCC(=O)N[C@H]1CCN(C1)c1cccc2OCCc12
: