Target
Prostaglandin G/H synthase 2
Ligand
BDBM50137423
Substrate
Meas. Tech.
ChEBML_159595
IC50
44±n/a nM
Citation
 Li, JDeMello, KMCheng, HSakya, SMBronk, BSRafka, RJJaynes, BHZiegler, CBKilroy, CMann, DWNimz, ELLynch, MPHaven, MLKolosko, NLMinich, MLLi, CDutra, JKRast, BCrosson, RMMorton, BJKirk, GWCallaghan, KMKoss, DAShavnya, ALund, LASeibel, SBPetras, CFSilvia, A Discovery of a potent, selective and orally active canine COX-2 inhibitor, 2-(3-difluoromethyl-5-phenyl-pyrazol-1-yl)-5-methanesulfonyl-pyridine. Bioorg Med Chem Lett 14:95-8 (2003)  
Target
Name:
Prostaglandin G/H synthase 2
Synonyms:
Cyclooxygenase-2 | Prostaglandin G/H synthase-2
Type:
PROTEIN
Mol. Mass.:
68982.35
Organism:
Canis familiaris
Description:
ChEMBL_344386
Residue:
604
  
Inhibitor
Name:
BDBM50137423
Synonyms:
2-(4-Chloro-3-difluoromethyl-5-phenyl-pyrazol-1-yl)-5-methanesulfonyl-pyridine | CHEMBL175485
Type:
Small organic molecule
Emp. Form.:
C16H12ClF2N3O2S
Mol. Mass.:
383.8
SMILES:
CS(=O)(=O)c1ccc(nc1)-n1nc(C(F)F)c(Cl)c1-c1ccccc1
: