Target
RNA-directed RNA polymerase
Ligand
BDBM50137472
Substrate
Meas. Tech.
ChEBML_143777
IC50
28000±n/a nM
Citation
 Beaulieu, PLBös, MBousquet, YFazal, GGauthier, JGillard, JGoulet, SLaPlante, SPoupart, MALefebvre, SMcKercher, GPellerin, CAustel, VKukolj, G Non-nucleoside inhibitors of the hepatitis C virus NS5B polymerase: discovery and preliminary SAR of benzimidazole derivatives. Bioorg Med Chem Lett 14:119-24 (2003)  
Target
Name:
RNA-directed RNA polymerase
Synonyms:
Hepatitis C virus NS5B RNA-dependent RNA polymerase | NS5B protein
Type:
Protein
Mol. Mass.:
25173.95
Organism:
Hepatitis C virus
Description:
Q8JXU8
Residue:
229
  
Inhibitor
Name:
BDBM50137472
Synonyms:
1-Cyclohexyl-2-pyridin-3-yl-1H-benzoimidazole-5-carboxylic acid | CHEMBL174838
Type:
Small organic molecule
Emp. Form.:
C19H19N3O2
Mol. Mass.:
321.3731
SMILES:
OC(=O)c1ccc2n(C3CCCCC3)c(nc2c1)-c1cccnc1
: