Target
DNA-directed RNA polymerase subunit beta
Ligand
BDBM50137490
Substrate
Meas. Tech.
ChEBML_164130
IC50
>500000±n/a nM
Citation
 Beaulieu, PLBös, MBousquet, YFazal, GGauthier, JGillard, JGoulet, SLaPlante, SPoupart, MALefebvre, SMcKercher, GPellerin, CAustel, VKukolj, G Non-nucleoside inhibitors of the hepatitis C virus NS5B polymerase: discovery and preliminary SAR of benzimidazole derivatives. Bioorg Med Chem Lett 14:119-24 (2003)  
Target
Name:
DNA-directed RNA polymerase subunit beta
Synonyms:
Bacterial DNA-directed RNA polymerase DNA-directed RNA polymerase subunit beta RNA polymerase subunit beta (β-RNAP) RPOB_ECOLI groN rif rpoB stv | tabD
Type:
Enzyme
Mol. Mass.:
150595.80
Organism:
Escherichia coli
Description:
P0A8V2
Residue:
1342
  
Inhibitor
Name:
BDBM50137490
Synonyms:
1-Cyclohexyl-2-thiophen-3-yl-1H-benzoimidazole-5-carboxylic acid | CHEMBL174564
Type:
Small organic molecule
Emp. Form.:
C18H18N2O2S
Mol. Mass.:
326.413
SMILES:
OC(=O)c1ccc2n(C3CCCCC3)c(nc2c1)-c1ccsc1
: