Target
Genome polyprotein
Ligand
BDBM50137958
Substrate
Meas. Tech.
ChEBML_143470
IC50
22000±n/a nM
Citation
 Goudreau, NCameron, DRBonneau, PGorys, VPlouffe, CPoirier, MLamarre, DLlinas-Brunet, M NMR structural characterization of peptide inhibitors bound to the Hepatitis C virus NS3 protease: design of a new P2 substituent. J Med Chem 47:123-32 (2003)  
Target
Name:
Genome polyprotein
Synonyms:
Hepatitis C virus NS3 protease/helicase | Hepatitis C virus serine protease, NS3/NS4A
Type:
Protein
Mol. Mass.:
67067.41
Organism:
Hepatitis C virus
Description:
A3EZI9
Residue:
631
  
Inhibitor
Name:
BDBM50137958
Synonyms:
1-((2S,4R)-1-((S)-2-((S)-2-acetamido-2-cyclohexylacetamido)-3-methylbutanoyl)-4-(quinolin-4-yloxy)pyrrolidine-2-carboxamido)cyclopropanecarboxylic acid CHEMBL367655
Type:
Small organic molecule
Emp. Form.:
C33H43N5O7
Mol. Mass.:
621.7238
SMILES:
CC(C)[C@H](NC(=O)[C@@H](NC(C)=O)C1CCCCC1)C(=O)N1C[C@@H](C[C@H]1C(=O)NC1(CC1)C(O)=O)Oc1ccnc2ccccc12
: