Target
Sodium- and chloride-dependent glycine transporter 2
Ligand
BDBM50138575
Substrate
Meas. Tech.
ChEBML_70977
IC50
130±n/a nM
Citation
 Ho, KKAppell, KCBaldwin, JJBohnstedt, ACDong, GGuo, THorlick, RIslam, KRKultgen, SGMasterson, CMMcDonald, EMcMillan, KMorphy, JRRankovic, ZSundaram, HWebb, M 2-(Aminomethyl)-benzamide-based glycine transporter type-2 inhibitors. Bioorg Med Chem Lett 14:545-8 (2003)  
Target
Name:
Sodium- and chloride-dependent glycine transporter 2
Synonyms:
GLYT2 NET1 SLC6A5 | Sodium- and chloride-dependent glycine transporter 2
Type:
Enzyme Catalytic Domain
Mol. Mass.:
87438.56
Organism:
Homo sapiens (Human)
Description:
Glycine-2-transporter 0 HUMAN::Q9Y345
Residue:
797
  
Inhibitor
Name:
BDBM50138575
Synonyms:
2-[(2-Hydroxy-6,7,8,9-tetrahydro-5H-benzocyclohepten-6-ylamino)-methyl]-N-(4-phenyl-but-3-enyl)-benzamide | CHEMBL150796
Type:
Small organic molecule
Emp. Form.:
C29H32N2O2
Mol. Mass.:
440.5766
SMILES:
Oc1ccc2CC(CCCc2c1)NCc1ccccc1C(=O)NCC\C=C\c1ccccc1
: