Target
Cathepsin K
Ligand
BDBM50138860
Substrate
Meas. Tech.
ChEMBL_45540 (CHEMBL656670)
IC50
47±n/a nM
Citation
 Tavares, FXBoncek, VDeaton, DNHassell, AMLong, STMiller, ABPayne, AAMiller, LRShewchuk, LMWells-Knecht, KWillard, DHWright, LLZhou, HQ Design of potent, selective, and orally bioavailable inhibitors of cysteine protease cathepsin k. J Med Chem 47:588-99 (2004)  
Target
Name:
Cathepsin K
Synonyms:
CATK_HUMAN CTSO Cathepsin O Cathepsin X
Type:
Enzyme
Mol. Mass.:
36975.68
Organism:
Homo sapiens (Human)
Description:
P43235
Residue:
329
  
Inhibitor
Name:
BDBM50138860
Synonyms:
CHEMBL156832 | [(S)-2-Methyl-1-(thiophen-2-ylmethyl)-aminooxalyl]-propyl)-carbamic acid 1-isopropyl-2-methyl-propyl ester
Type:
Small organic molecule
Emp. Form.:
C19H30N2O4S
Mol. Mass.:
382.518
SMILES:
CC(C)C(OC(=O)N[C@@H](C(C)C)C(=O)C(=O)NCc1cccs1)C(C)C
: