Target
Growth hormone secretagogue receptor type 1
Ligand
BDBM50049481
Substrate
Meas. Tech.
ChEMBL_72511 (CHEMBL685176)
IC50
60±n/a nM
Citation
 Bondensgaard, KAnkersen, MThøgersen, HHansen, BSWulff, BSBywater, RP Recognition of privileged structures by G-protein coupled receptors. J Med Chem 47:888-99 (2004)  
Target
Name:
Growth hormone secretagogue receptor type 1
Synonyms:
GH-releasing peptide receptor GHS-R Ghrelin receptor Growth hormone secretagogue receptor type 1
Type:
PROTEIN
Mol. Mass.:
40970.19
Organism:
Rattus norvegicus
Description:
ChEMBL_11556
Residue:
364
  
Inhibitor
Name:
BDBM50049481
Synonyms:
(R)-N-(1-((2'-(2H-tetrazol-5-yl)biphenyl-4-yl)methyl)-2-oxo-2,3,4,5-tetrahydro-1H-benzo[b]azepin-3-yl)-3-amino-3-methylbutanamide 3-Amino-3-methyl-N-{2-oxo-1-[2'-(1H-tetrazol-5-yl)-biphenyl-4-ylmethyl]-2,3,4,5-tetrahydro-1H-benzo[b]azepin-3-yl}-butyramide Arg-Pro-Lys-Pro-Phe-Trp-Leu L-692429
Type:
Small organic molecule
Emp. Form.:
C29H31N7O2
Mol. Mass.:
509.6021
SMILES:
CC(C)(N)CC(=O)N[C@@H]1CCc2ccccc2N(Cc2ccc(cc2)-c2ccccc2-c2nnn[nH]2)C1=O
: