Target
Growth hormone secretagogue receptor type 1
Ligand
BDBM50139791
Substrate
Meas. Tech.
ChEMBL_72515 (CHEMBL685180)
IC50
190±n/a nM
Citation
 Bondensgaard, KAnkersen, MThøgersen, HHansen, BSWulff, BSBywater, RP Recognition of privileged structures by G-protein coupled receptors. J Med Chem 47:888-99 (2004)  
Target
Name:
Growth hormone secretagogue receptor type 1
Synonyms:
GH-releasing peptide receptor GHS-R GHSR_HUMAN Ghrelin receptor | Ghrelin receptor 1a (GHS-R1a)
Type:
Receptor
Mol. Mass.:
41334.57
Organism:
Homo sapiens (Human)
Description:
Receptor binding studies use plasma membranes from LLC PK-1 cells transiently transfected with hGHSR1a.
Residue:
366
  
Inhibitor
Name:
BDBM50139791
Synonyms:
CHEMBL353007 | MC4 ligand
Type:
Small organic molecule
Emp. Form.:
C32H35ClN4O4S
Mol. Mass.:
607.163
SMILES:
CS(=O)(=O)N1CC2(CCN(CC2)C(=O)[C@@H](Cc2ccc(Cl)cc2)NC(=O)C2Cc3ccccc3CN2)c2ccccc12
: