Target
Solute carrier family 15 member 1
Ligand
BDBM50139890
Substrate
Meas. Tech.
ChEMBL_89215 (CHEMBL699707)
Ki
400±n/a nM
Citation
 Våbenø, JLejon, TNielsen, CUSteffansen, BChen, WOuyang, HBorchardt, RTLuthman, K Phe-Gly dipeptidomimetics designed for the di-/tripeptide transporters PEPT1 and PEPT2: synthesis and biological investigations. J Med Chem 47:1060-9 (2004)  
Target
Name:
Solute carrier family 15 member 1
Synonyms:
Intestinal H(+)/peptide cotransporter Oligopeptide transporter, small intestine isoform Peptide transporter 1 SLC15A1
Type:
PROTEIN
Mol. Mass.:
78818.07
Organism:
Homo sapiens (Human)
Description:
ChEMBL_1488839
Residue:
708
  
Inhibitor
Name:
BDBM50139890
Synonyms:
(S)-5-Amino-4-oxo-6-phenyl-hexanoic acid | CHEMBL10650
Type:
Small organic molecule
Emp. Form.:
C12H15NO3
Mol. Mass.:
221.2524
SMILES:
N[C@@H](Cc1ccccc1)C(=O)CCC(O)=O
: