Target
Orexin receptor type 2
Ligand
BDBM50139963
Substrate
Meas. Tech.
ChEMBL_147797 (CHEMBL757347)
EC50
>1000000±n/a nM
Citation
 Lang, MSöll, RMDürrenberger, FDautzenberg, FMBeck-Sickinger, AG Structure-activity studies of orexin a and orexin B at the human orexin 1 and orexin 2 receptors led to orexin 2 receptor selective and orexin 1 receptor preferring ligands. J Med Chem 47:1153-60 (2004)  
Target
Name:
Orexin receptor type 2
Synonyms:
HCRTR2 OX2R_HUMAN Orexin receptor type 2 (OR-2) Orexin receptor type 2 (OX2R) Ox-2-R | Ox2-R
Type:
Protein
Mol. Mass.:
50710.53
Organism:
Homo sapiens (Human)
Description:
O43614
Residue:
444
  
Inhibitor
Name:
BDBM50139963
Synonyms:
CHEMBL386724 | R-S-G-P-P-G-L-Q-G-R
Type:
Small organic molecule
Emp. Form.:
C42H73N17O13
Mol. Mass.:
1024.1351
SMILES:
CC(C)C[C@H](NC(=O)CNC(=O)[C@@H]1CCCN1C(=O)[C@@H]1CCCN1C(=O)CNC(=O)[C@H](CO)NC(=O)[C@@H](N)CCCN=C(N)N)C(=O)N[C@@H](CCC(N)=O)C(=O)NCC(=O)N[C@@H](CCCN=C(N)N)C(O)=O
: