Target
Potassium voltage-gated channel subfamily H member 2
Ligand
BDBM50141979
Substrate
Meas. Tech.
ChEBML_215107
Ki
9600±n/a nM
Citation
 Shu, MLoebach, JLParker, KAMills, SGChapman, KTShen, DMMalkowitz, LSpringer, MSGould, SLDeMartino, JASiciliano, SJSalvo, JDLyons, KPivnichny, JVKwei, GYCarella, ACarver, GHolmes, KSchleif, WADanzeisen, RHazuda, DKessler, JLineberger, JMiller, MDEmini, EA Antagonists of human CCR5 receptor containing 4-(pyrazolyl)piperidine side chains. Part 3: SAR studies on the benzylpyrazole segment. Bioorg Med Chem Lett 14:947-52 (2004)  
Target
Name:
Potassium voltage-gated channel subfamily H member 2
Synonyms:
1,3-beta-glucan synthase component GLS2 ERG Eag-related protein 1 Ether-a-go-go-related gene (HERG) Ether-a-go-go-related gene potassium channel 1 Ether-a-go-go-related gene potassium channel 1 (hERG1) Ether-a-go-go-related protein 1 H-ERG KCNH2 Potassium voltage-gated channel subfamily H member 2 (hERG) Voltage-gated potassium channel subunit Kv11.1 hERG Potassium Channel 1 | putative potassium channel subunit
Type:
Multi-pass membrane protein
Mol. Mass.:
126672.65
Organism:
Homo sapiens (Human)
Description:
Q12809
Residue:
1159
  
Inhibitor
Name:
BDBM50141979
Synonyms:
(R)-2-[(2S,3S)-3-{4-[2-Ethyl-5-(4-isopropoxy-benzyl)-2H-pyrazol-3-yl]-piperidin-1-ylmethyl}-4-(3-fluoro-phenyl)-pyrrolidin-1-yl]-3,3-dimethyl-butyric acid | CHEMBL368204
Type:
Small organic molecule
Emp. Form.:
C37H51FN4O3
Mol. Mass.:
618.8242
SMILES:
CCn1nc(Cc2ccc(OC(C)C)cc2)cc1C1CCN(C[C@H]2CN(C[C@@H]2c2cccc(F)c2)[C@@H](C(O)=O)C(C)(C)C)CC1
: