Target
Neuronal acetylcholine receptor subunit alpha-4/beta-4
Ligand
BDBM50100707
Substrate
Meas. Tech.
ChEMBL_144014 (CHEMBL750429)
EC50
239±n/a nM
Citation
 Carroll, FI Epibatidine structure-activity relationships. Bioorg Med Chem Lett 14:1889-96 (2004)  
Target
Name:
Neuronal acetylcholine receptor subunit alpha-4/beta-4
Synonyms:
Neuronal acetylcholine receptor protein alpha-4/beta-4 subunit nAChR subtypes alpha4 beta4
Type:
Mol. Mass.:
Description:
ASSAY_ID of EBI is 144014
Components:
This complex has 2 components.
Component 1
Name:
Neuronal acetylcholine receptor subunit alpha-4
Synonyms:
ACHA4_RAT Cholinergic, Nicotinic Alpha4Beta2 Chrna4 Neuronal acetylcholine receptor (alpha4beta2 nAChR) Neuronal acetylcholine receptor subunit alpha 4 beta 2 | Neuronal acetylcholine receptor subunit alpha-4
Type:
Enzyme
Mol. Mass.:
70196.44
Organism:
Rattus norvegicus (Rat)
Description:
P09483
Residue:
630
  
Component 2
Name:
Neuronal acetylcholine receptor subunit beta-4
Synonyms:
ACHB4_RAT Chrnb4 Neuronal acetylcholine receptor non-alpha-2 chain | Neuronal acetylcholine receptor protein beta-4 subunit
Type:
Enzyme
Mol. Mass.:
55863.89
Organism:
Rattus norvegicus (Rat)
Description:
P12392
Residue:
495
  
Inhibitor
Name:
BDBM50100707
Synonyms:
(R)-2-(6-Fluoro-pyridin-3-yl)-7-aza-bicyclo[2.2.1]heptane 2-(6-fluoropyridin-3-yl)-7-aza-bicyclo[2.2.1]heptane | CHEMBL56682
Type:
Small organic molecule
Emp. Form.:
C11H13FN2
Mol. Mass.:
192.2327
SMILES:
Fc1ccc(cn1)C1CC2CCC1N2
: