Target
Cytochrome P450 2D6
Ligand
BDBM50143965
Substrate
Meas. Tech.
ChEBML_51740
Ki
7000±n/a nM
Citation
 Ashwell, MALapierre, JMKaplan, ALi, JMarr, CYuan, J The design, preparation and SAR of novel small molecule sodium (Na(+)) channel blockers. Bioorg Med Chem Lett 14:2025-30 (2004)  
Target
Name:
Cytochrome P450 2D6
Synonyms:
CP2D6_HUMAN CYP2DL1 Cytochrome P450 2D6 (CYP2D6) P450-DB1
Type:
Protein
Mol. Mass.:
55774.82
Organism:
Homo sapiens (Human)
Description:
P10635
Residue:
497
  
Inhibitor
Name:
BDBM50143965
Synonyms:
CHEMBL60666 | N-(2-{4-[3-(4-Chloro-phenoxy)-2-hydroxy-propyl]-piperazin-1-yl}-2-phenyl-ethyl)-2-methoxy-benzamide
Type:
Small organic molecule
Emp. Form.:
C29H34ClN3O4
Mol. Mass.:
524.051
SMILES:
COc1ccccc1C(=O)NCC(N1CCN(CC(O)COc2ccc(Cl)cc2)CC1)c1ccccc1
: