Target
Cytochrome P450 2D6
Ligand
BDBM50143951
Substrate
Meas. Tech.
ChEBML_51740
Ki
100±n/a nM
Citation
 Ashwell, MALapierre, JMKaplan, ALi, JMarr, CYuan, J The design, preparation and SAR of novel small molecule sodium (Na(+)) channel blockers. Bioorg Med Chem Lett 14:2025-30 (2004)  
Target
Name:
Cytochrome P450 2D6
Synonyms:
CP2D6_HUMAN CYP2DL1 Cytochrome P450 2D6 (CYP2D6) P450-DB1
Type:
Protein
Mol. Mass.:
55774.82
Organism:
Homo sapiens (Human)
Description:
P10635
Residue:
497
  
Inhibitor
Name:
BDBM50143951
Synonyms:
1-Allyloxy-3-{4-[(4-chloro-phenyl)-phenyl-methyl]-piperazin-1-yl}-propan-2-ol | CHEMBL59639
Type:
Small organic molecule
Emp. Form.:
C23H29ClN2O2
Mol. Mass.:
400.942
SMILES:
OC(COCC=C)CN1CCN(CC1)C(c1ccccc1)c1ccc(Cl)cc1
: