Target
Cytochrome P450 2D6
Ligand
BDBM50143962
Substrate
Meas. Tech.
ChEBML_51740
Ki
1000±n/a nM
Citation
 Ashwell, MALapierre, JMKaplan, ALi, JMarr, CYuan, J The design, preparation and SAR of novel small molecule sodium (Na(+)) channel blockers. Bioorg Med Chem Lett 14:2025-30 (2004)  
Target
Name:
Cytochrome P450 2D6
Synonyms:
CP2D6_HUMAN CYP2DL1 Cytochrome P450 2D6 (CYP2D6) P450-DB1
Type:
Protein
Mol. Mass.:
55774.82
Organism:
Homo sapiens (Human)
Description:
P10635
Residue:
497
  
Inhibitor
Name:
BDBM50143962
Synonyms:
CHEMBL62878 | N-(2-{4-[3-(4-Chloro-phenoxy)-2-hydroxy-propyl]-piperazin-1-yl}-2-phenyl-ethyl)-4-trifluoromethyl-benzamide
Type:
Small organic molecule
Emp. Form.:
C29H31ClF3N3O3
Mol. Mass.:
562.023
SMILES:
OC(COc1ccc(Cl)cc1)CN1CCN(CC1)C(CNC(=O)c1ccc(cc1)C(F)(F)F)c1ccccc1
: