Target
Mu-type opioid receptor
Ligand
BDBM50144276
Substrate
Meas. Tech.
ChEBML_149324
Ki
0.260000±n/a nM
Citation
 Carson, JRCoats, SJCodd, EEDax, SLLee, JMartinez, RPMcKown, LAAnne Neilson, LPitis, PMWu, WNZhang, SP N-alkyl-4-[(8-azabicyclo[3.2.1]-oct-3-ylidene)phenylmethyl]benzamides, micro and delta opioid agonists: a micro address. Bioorg Med Chem Lett 14:2113-6 (2004)  
Target
Name:
Mu-type opioid receptor
Synonyms:
M-OR-1 MOR-1 MUOR1 Mu opiate receptor OPRM1 hMOP | mu-type opioid receptor isoform MOR-1
Type:
G Protein-Coupled Receptor (GPCR)
Mol. Mass.:
44789.51
Organism:
Homo sapiens (Human)
Description:
P35372
Residue:
400
  
Inhibitor
Name:
BDBM50144276
Synonyms:
CHEMBL63651 | N-Ethyl-4-{[(1S,5R)-8-phenethyl-8-aza-bicyclo[3.2.1]oct-(3Z)-ylidene]-phenyl-methyl}-benzamide
Type:
Small organic molecule
Emp. Form.:
C31H34N2O
Mol. Mass.:
450.6145
SMILES:
CCNC(=O)c1ccc(cc1)C(=C1\C[C@@H]2CC[C@H](C1)N2CCc1ccccc1)\c1ccccc1
: