Target
cGMP-dependent 3',5'-cyclic phosphodiesterase
Ligand
BDBM50034908
Substrate
Meas. Tech.
ChEBML_156320
IC50
5000±n/a nM
Citation
 Abbott, BMThompson, PE PDE2 inhibition by the PI3 kinase inhibitor LY294002 and analogues. Bioorg Med Chem Lett 14:2847-51 (2004)  
Target
Name:
cGMP-dependent 3',5'-cyclic phosphodiesterase
Synonyms:
CGS-PDE Homo sapiens phosphodiesterase 2A (PDE2A) PDE2A cGSPDE
Type:
Enzyme Catalytic Domain
Mol. Mass.:
105691.58
Organism:
Homo sapiens (Human)
Description:
O00408
Residue:
941
  
Inhibitor
Name:
BDBM50034908
Synonyms:
(2R,3S)-3-((R)-6-Amino-purin-9-yl)-nonan-2-ol (2R,3S)-3-(6-amino-9H-purin-9-yl)nonan-2-ol 3-(6-Amino-purin-9-yl)-nonan-2-ol CHEMBL50378
Type:
Small organic molecule
Emp. Form.:
C14H23N5O
Mol. Mass.:
277.3653
SMILES:
CCCCCC[C@@H]([C@@H](C)O)n1cnc2c(N)ncnc12
: