Target
Disintegrin and metalloproteinase domain-containing protein 17
Ligand
BDBM50146475
Substrate
Meas. Tech.
ChEBML_212749
IC50
3±n/a nM
Citation
 Kamei, NTanaka, TKawai, KMiyawaki, KOkuyama, AMurakami, YArakawa, YHaino, MHarada, TShimano, M Reverse hydroxamate-based selective TACE inhibitors. Bioorg Med Chem Lett 14:2897-900 (2004)  
Target
Name:
Disintegrin and metalloproteinase domain-containing protein 17
Synonyms:
ADA17_HUMAN CSVP Disintegrin and metalloproteinase domain-containing protein 17 (ADAM17) TNF-alpha convertase TNF-alpha-converting enzyme (TACE) Tumor necrosis factor-α converting enzyme (TACE)
Type:
Enzyme
Mol. Mass.:
93007.89
Organism:
Homo sapiens (Human)
Description:
Residue:
824
  
Inhibitor
Name:
BDBM50146475
Synonyms:
CHEMBL98202 | N-Hydroxy-N-[2-[4-(2-methyl-quinolin-4-ylmethoxy)-benzenesulfonyl]-1-(tetrahydro-thiopyran-4-ylidenemethyl)-ethyl]-formamide
Type:
Small organic molecule
Emp. Form.:
C26H28N2O5S2
Mol. Mass.:
512.641
SMILES:
[#6]-c1cc(-[#6]-[#8]-c2ccc(cc2)S(=O)(=O)[#6]-[#6](\[#6]=[#6]-2\[#6]-[#6]-[#16]-[#6]-[#6]-2)-[#7](-[#8])-[#6]=O)c2ccccc2n1
: