Target
Sodium-dependent serotonin transporter
Ligand
BDBM50150099
Substrate
Meas. Tech.
ChEMBL_201813 (CHEMBL805321)
Ki
0.49±n/a nM
Citation
 Mewshaw, REZhou, DZhou, PShi, XHornby, GSpangler, TScerni, RSmith, DSchechter, LEAndree, TH Studies toward the discovery of the next generation of antidepressants. 3. Dual 5-HT1A and serotonin transporter affinity within a class of N-aryloxyethylindolylalkylamines. J Med Chem 47:3823-42 (2004)  
Target
Name:
Sodium-dependent serotonin transporter
Synonyms:
5-HT Transporter 5HT transporter Anandamid membrane transporter, AMT Monoamine transporters; Norepinephrine & serotonin Slc6a4 Sodium-dependent serotonin transporter (SERT) | imipramine receptor
Type:
Multi-pass membrane protein
Mol. Mass.:
70168.43
Organism:
Rattus norvegicus (rat)
Description:
P31652
Residue:
630
  
Inhibitor
Name:
BDBM50150099
Synonyms:
CHEMBL339490 | [2-(7-Fluoro-2,3-dihydro-benzo[1,4]dioxin-5-yloxy)-ethyl]-[3-(5-fluoro-1H-indol-3-yl)-propyl]-amine
Type:
Small organic molecule
Emp. Form.:
C21H22F2N2O3
Mol. Mass.:
388.4078
SMILES:
Fc1ccc2[nH]cc(CCCNCCOc3cc(F)cc4OCCOc34)c2c1
: