Target
Sodium-dependent serotonin transporter
Ligand
BDBM50150090
Substrate
Meas. Tech.
ChEMBL_201813 (CHEMBL805321)
Ki
1.2±n/a nM
Citation
 Mewshaw, REZhou, DZhou, PShi, XHornby, GSpangler, TScerni, RSmith, DSchechter, LEAndree, TH Studies toward the discovery of the next generation of antidepressants. 3. Dual 5-HT1A and serotonin transporter affinity within a class of N-aryloxyethylindolylalkylamines. J Med Chem 47:3823-42 (2004)  
Target
Name:
Sodium-dependent serotonin transporter
Synonyms:
5-HT Transporter 5HT transporter Anandamid membrane transporter, AMT Monoamine transporters; Norepinephrine & serotonin Slc6a4 Sodium-dependent serotonin transporter (SERT) | imipramine receptor
Type:
Multi-pass membrane protein
Mol. Mass.:
70168.43
Organism:
Rattus norvegicus (rat)
Description:
P31652
Residue:
630
  
Inhibitor
Name:
BDBM50150090
Synonyms:
CHEMBL125902 | [3-(5-Fluoro-1H-indol-3-yl)-propyl]-[2-(quinoxalin-5-yloxy)-ethyl]-amine
Type:
Small organic molecule
Emp. Form.:
C21H21FN4O
Mol. Mass.:
364.416
SMILES:
Fc1ccc2[nH]cc(CCCNCCOc3cccc4nccnc34)c2c1
: