Target
Phenylethanolamine N-methyltransferase
Ligand
BDBM13014
Substrate
Meas. Tech.
ChEMBL_303718 (CHEMBL829053)
Ki
3.1±n/a nM
Citation
 Romero, FAVodonick, SMCriscione, KRMcLeish, MJGrunewald, GL Inhibitors of phenylethanolamine N-methyltransferase that are predicted to penetrate the blood-brain barrier: design, synthesis, and evaluation of 3-fluoromethyl-7-(N-substituted aminosulfonyl)-1,2,3,4-tetrahydroisoquinolines that possess low affinity toward the alpha2-adrenoceptor. J Med Chem 47:4483-93 (2004)  
Target
Name:
Phenylethanolamine N-methyltransferase
Synonyms:
Noradrenaline N-methyltransferase PNMT PNMTase | Phenylethanolamine N-Methyltransferase (PNMT)
Type:
Enzyme
Mol. Mass.:
30852.66
Organism:
Homo sapiens (Human)
Description:
Residue:
282
  
Inhibitor
Name:
BDBM13014
Synonyms:
7,8-Dichloro-1,2,3,4-tetrahydro-isoquinoline; hydrochloride CHEMBL287837 SKF 64139 | tetrahydroisoquinoline (THIQ) analogue
Type:
Small organic molecule
Emp. Form.:
C9H9Cl2N
Mol. Mass.:
202.08
SMILES:
Clc1ccc2CCNCc2c1Cl
: