Target
Metabotropic glutamate receptor 2
Ligand
BDBM50151481
Substrate
Meas. Tech.
ChEMBL_303460 (CHEMBL839720)
Ki
1.61±n/a nM
Citation
 Nakazato, ASakagami, KYasuhara, AOhta, HYoshikawa, RItoh, MNakamura, MChaki, S Synthesis, in vitro pharmacology, structure-activity relationships, and pharmacokinetics of 3-alkoxy-2-amino-6-fluorobicyclo[3.1.0]hexane-2,6-dicarboxylic acid derivatives as potent and selective group II metabotropic glutamate receptor antagonists. J Med Chem 47:4570-87 (2004)  
Target
Name:
Metabotropic glutamate receptor 2
Synonyms:
GPRC1B GRM2_HUMAN Metabotropic glutamate receptor mGlu2 | metabotropic glutamate 2
Type:
Enzyme
Mol. Mass.:
95584.88
Organism:
Homo sapiens (Human)
Description:
Q14416
Residue:
872
  
Inhibitor
Name:
BDBM50151481
Synonyms:
(1R,2R,3R,5R,6R)-2-Amino-3-[(R)-1-(3,4-dichloro-phenyl)-propoxy]-6-fluoro-bicyclo[3.1.0]hexane-2,6-dicarboxylic acid | CHEMBL184983
Type:
Small organic molecule
Emp. Form.:
C17H18Cl2FNO5
Mol. Mass.:
406.233
SMILES:
CC[C@@H](O[C@@H]1C[C@@H]2[C@@H]([C@@]2(F)C(O)=O)[C@]1(N)C(O)=O)c1ccc(Cl)c(Cl)c1
: