Target
Melanocortin receptor 3
Ligand
BDBM50152260
Substrate
Meas. Tech.
ChEMBL_310168 (CHEMBL824824)
EC50
145±n/a nM
Citation
 Koikov, LNEbetino, FHHayes, JCCross-Doersen, DKnittel, JJ End-capping of the modified melanocortin tetrapeptide (p-Cl)Phe-D-Phe-Arg-Trp-NH2 as a route to hMC4R agonists. Bioorg Med Chem Lett 14:4839-42 (2004)  
Target
Name:
Melanocortin receptor 3
Synonyms:
MC3-R MC3R_HUMAN Melanocortin receptor (M3 and M4)
Type:
Enzyme
Mol. Mass.:
36044.86
Organism:
Homo sapiens (Human)
Description:
P41968
Residue:
323
  
Inhibitor
Name:
BDBM50152260
Synonyms:
2-{(S)-2-[(S)-3-(4-Chloro-phenyl)-2-(2,2-dimethyl-propionylamino)-1-oxo-propylamino]-3-phenyl-propionylamino}-5-guanidino-pentanoic acid [(S)-1-carbamoyl-2-(1H-indol-3-yl)-ethyl]-amide | CHEMBL359927
Type:
Small organic molecule
Emp. Form.:
C40H50ClN9O5
Mol. Mass.:
772.335
SMILES:
CC(C)(C)C(=O)N[C@@H](Cc1ccc(Cl)cc1)C(=O)N[C@@H](Cc1ccccc1)C(=O)N[C@@H](CCCNC(N)=N)C(=O)N[C@@H](Cc1c[nH]c2ccccc12)C(N)=O
: