Target
Mitogen-activated protein kinase 14
Ligand
BDBM50153821
Substrate
Meas. Tech.
ChEMBL_305841 (CHEMBL829582)
IC50
10±n/a nM
Citation
 Brown, DSBelfield, AJBrown, GRCampbell, DFoubister, AMasters, DJPike, KGSnelson, WLWells, SL A novel series of p38 MAP kinase inhibitors for the potential treatment of rheumatoid arthritis. Bioorg Med Chem Lett 14:5383-7 (2004)  
Target
Name:
Mitogen-activated protein kinase 14
Synonyms:
CSAID-binding protein CSBP1 CSPB1 MAP kinase 14 MAP kinase p38 alpha MAPK14 MK14_HUMAN Mitogen-activated protein kinase p38 alpha Stress-activated protein kinase 2a | p38 MAP kinase alpha/beta
Type:
Serine/threonine-protein kinase
Mol. Mass.:
41286.76
Organism:
Homo sapiens (Human)
Description:
Q16539
Residue:
360
  
Inhibitor
Name:
BDBM50153821
Synonyms:
3-Fluoro-N-{4-methyl-3-[4-(pyridin-4-ylmethoxy)-benzoylamino]-phenyl}-5-morpholin-4-yl-benzamide | CHEMBL183999
Type:
Small organic molecule
Emp. Form.:
C31H29FN4O4
Mol. Mass.:
540.5848
SMILES:
Cc1ccc(NC(=O)c2cc(F)cc(c2)N2CCOCC2)cc1NC(=O)c1ccc(OCc2ccncc2)cc1
: