Target
Mitogen-activated protein kinase 14
Ligand
BDBM50153880
Substrate
Meas. Tech.
ChEMBL_305835 (CHEMBL874544)
IC50
30±n/a nM
Citation
 Cumming, JGMcKenzie, CLBowden, SGCampbell, DMasters, DJBreed, JJewsbury, PJ Novel, potent and selective anilinoquinazoline and anilinopyrimidine inhibitors of p38 MAP kinase. Bioorg Med Chem Lett 14:5389-94 (2004)  
Target
Name:
Mitogen-activated protein kinase 14
Synonyms:
CSAID-binding protein CSBP1 CSPB1 MAP kinase 14 MAP kinase p38 alpha MAPK14 MK14_HUMAN Mitogen-activated protein kinase p38 alpha Stress-activated protein kinase 2a | p38 MAP kinase alpha/beta
Type:
Serine/threonine-protein kinase
Mol. Mass.:
41286.76
Organism:
Homo sapiens (Human)
Description:
Q16539
Residue:
360
  
Inhibitor
Name:
BDBM50153880
Synonyms:
CHEMBL364576 | N-[3-(6,7-Dimethoxy-quinazolin-4-ylamino)-4-methyl-phenyl]-3-dimethylamino-benzamide
Type:
Small organic molecule
Emp. Form.:
C26H27N5O3
Mol. Mass.:
457.5243
SMILES:
COc1cc2ncnc(Nc3cc(NC(=O)c4cccc(c4)N(C)C)ccc3C)c2cc1OC
: