Target
Mitogen-activated protein kinase 14
Ligand
BDBM50153879
Substrate
Meas. Tech.
ChEMBL_305835 (CHEMBL874544)
IC50
50±n/a nM
Citation
 Cumming, JGMcKenzie, CLBowden, SGCampbell, DMasters, DJBreed, JJewsbury, PJ Novel, potent and selective anilinoquinazoline and anilinopyrimidine inhibitors of p38 MAP kinase. Bioorg Med Chem Lett 14:5389-94 (2004)  
Target
Name:
Mitogen-activated protein kinase 14
Synonyms:
CSAID-binding protein CSBP1 CSPB1 MAP kinase 14 MAP kinase p38 alpha MAPK14 MK14_HUMAN Mitogen-activated protein kinase p38 alpha Stress-activated protein kinase 2a | p38 MAP kinase alpha/beta
Type:
Serine/threonine-protein kinase
Mol. Mass.:
41286.76
Organism:
Homo sapiens (Human)
Description:
Q16539
Residue:
360
  
Inhibitor
Name:
BDBM50153879
Synonyms:
CHEMBL426969 | N-{4-Methyl-3-[2-(3-pyrrolidin-1-yl-propylamino)-pyrimidin-4-ylamino]-phenyl}-2-morpholin-4-yl-isonicotinamide
Type:
Small organic molecule
Emp. Form.:
C28H36N8O2
Mol. Mass.:
516.6378
SMILES:
Cc1ccc(NC(=O)c2ccnc(c2)N2CCOCC2)cc1Nc1ccnc(NCCCN2CCCC2)n1
: